Kunigunde von Halitsch
type: Concept
type: person
preferred label: Kunigunda of Halych @en
definition: Auch Kunigunde von Machow, Kunigunde von Ungarn bzw. Kunigunde von Kyjiw (Kiew).Durch Heirat Königin von Böhmen sowie Herzogin von Österreich, Steiermark, Kärnten und Krain.
gender: female
surname: Kunigunde von Halitsch
surname: Kunigunda of Halych @en
date of birth: 1245
date of death: 1285
date of birth and death: 1245-09.09.1285
function or role: Dargestellte/r
in scheme: person
created: 2025-11-01
creator: mk berlin

Dargestellte/r
preferred label: Sitter @en