Sophie (1241-1248), Herzogin von Brabant
type: Concept
type: person
preferred label: Sophie (1241-1248), duchess of Brabant @en
definition: Sophie von Brabant, Sophie von Hessen bzw. Sophie von Thüringen.
gender: female
surname: Sophie (1241-1248), Herzogin von Brabant
surname: Sophie (1241-1248), duchess of Brabant @en
date of birth: 1224
date of death: 1275
date of birth and death: 20.03.1224 - 29.05.1275
function or role: Dargestellte/r
function or role: Autorität
in scheme: person
created: 2025-11-01
creator: mk berlin

Dargestellte/r
preferred label: Sitter @en

Autorität
preferred label: Authority @en