Anne-Marie Vogler
type: Concept
type: person
definition: Deutsche Bildhauerin, Graphikerin und Medailleurin.
gender: female
forename: Anne-Marie
surname: Vogler
date of birth: 1892
date of death: 1983
date of birth and death: 07.06.1892 - 30.05.1983
function or role: Medailleur/in
in scheme: person
created: 2025-11-03
modified: 2025-11-03
creator: mk berlin

Medailleur/in
preferred label: Medalist @en