Mary Warburg
type: Concept
type: person
definition: Deutsche Malerin, Bildhauerin und Medailleurin.
gender: female
forename: Mary
surname: Warburg
date of birth: 1866
date of death: 1934
date of birth and death: 13.10.1866 - 04.12.1934
function or role: Medailleur/in
in scheme: person
created: 2025-11-02
creator: mk berlin

Medailleur/in
preferred label: Medalist @en