Hans Schwathe
type: Concept
type: person
definition: Österreichischer Bildhauer und Medailleur.
gender: male
forename: Hans
surname: Schwathe
date of birth: 1870
date of death: 1950
date of birth and death: 28.05.1870 - 27.10.1950
function or role: Medailleur/in
in scheme: person
created: 2025-11-03
creator: mk berlin

Medailleur/in
preferred label: Medalist @en