Paul Henle
type: Concept
type: person
definition: Deutscher Bildhauer, Maler und Medailleur.
gender: male
forename: Paul
surname: Henle
date of birth: 1887
date of death: 1962
date of birth and death: 20.03.1887 - 12.09.1962
function or role: Medailleur/in
in scheme: person
created: 2025-11-03
modified: 2025-11-03
creator: mk berlin

Medailleur/in
preferred label: Medalist @en