André Masson
type: Concept
type: person
definition: Französischer Bildhauer, Graphiker, Maler und Medailleur.
gender: male
forename: André
surname: Masson
date of birth: 1896
date of death: 1987
date of birth and death: 04.01.1896 - 28.10.1987
function or role: Medailleur/in
in scheme: person
created: 2025-11-03
creator: mk berlin

Medailleur/in
preferred label: Medalist @en