Alfred Beit
type: Concept
type: person
definition: Aus Hamburg gebürtiger britisch-südafrikanischer Gold- und Diamantenmagnat.Kunstsammler und Mäzen.
gender: male
forename: Alfred
surname: Beit
date of birth: 1853
date of death: 1906
date of birth and death: 15.02.1853 - 16.07.1906
function or role: Vorbesitzer
in scheme: person
created: 2025-11-03
creator: mk berlin

Vorbesitzer
preferred label: previous Owner @en