Peter Gustaf Dorén
type: Concept
type: person
definition: Peter Gustaf (sic!) Dorén, geboren 1857 in Zireköüinge, Schweden.Dekorationsmaler und Kunstgewerbler, betrieb seit 1887 in Hamburg ein Atelier für Dekorationsmalerei und die „Werkstätten für Wohnungskunst“.
gender: male
forename: Peter Gustaf
surname: Dorén
date of birth: 1857
date of death: 1942
date of birth and death: 1857-1942
function or role: Dargestellte/r
in scheme: person
created: 2025-11-03
modified: 2025-11-03
creator: mk berlin

Dargestellte/r
preferred label: Sitter @en