Leutnant Egon von Lerch
type: Concept
type: person
preferred label: Lieutenant Egon von Lerch @en
definition: Österreichisch-ungarischer Marineoffizier.Kommandant von U 12.
gender: male
prefix: Leutnant
prefix: Lieutenant @en
forename: Egon von
surname: Lerch
date of birth: 1886
date of death: 1915
date of birth and death: 19.06.1886 - 08.08.1915
function or role: Geehrte/r (ohne Bildnis)
in scheme: person
created: 2025-11-03
creator: mk berlin

Geehrte/r (ohne Bildnis)
preferred label: honored person (no portrait) @en