Korvettenkapitän Georg von Trapp
type: Concept
type: person
preferred label: Corvette Captain Georg von Trapp @en
definition: Österreichisch-Ungarischer U-Boot-Kommandant.
gender: male
prefix: Korvettenkapitän
prefix: Corvette Captain @en
forename: Georg von
surname: Trapp
date of birth: 1880
date of death: 1947
date of birth and death: 04.04.1880 - 30.05.1947
function or role: Geehrte/r (ohne Bildnis)
in scheme: person
created: 2025-11-03
creator: mk berlin

Geehrte/r (ohne Bildnis)
preferred label: honored person (no portrait) @en