Armande Defly, geborene Dieudé
type: Concept
type: person
preferred label: Armande Defly, née Dieudé @en
definition: Mdame Deflys Bildnis erscheint auf einer Medaille von 1863.
gender: female
forename: Armande
surname: Defly, geborene Dieudé
surname: Defly, née Dieudé @en
date of birth: 1785
date of death: 1875
date of birth and death: 1785-1875
function or role: Dargestellte/r
in scheme: person
created: 2025-11-03
modified: 2025-11-03
creator: mk berlin

Dargestellte/r
preferred label: Sitter @en