Anna Papot
type: Concept
type: person
definition: Anna Papots Bildnis erscheint auf einer Plakette von Alexandre Charpentier aus dem Jahre 1891.
gender: female
forename: Anna
surname: Papot
function or role: Dargestellte/r
in scheme: person
created: 2025-11-03
modified: 2025-11-03
creator: mk berlin

Dargestellte/r
preferred label: Sitter @en