Jean Charpentier
type: Concept
type: person
definition: Sohn des Alexandre Charpentier (1856-1909).
gender: male
forename: Jean
surname: Charpentier
date of birth: 1884
date of birth and death: 23.03.1884-
function or role: Dargestellte/r
in scheme: person
created: 2025-11-03
modified: 2025-11-03
creator: mk berlin

Dargestellte/r
preferred label: Sitter @en