Juliette Paganon
type: Concept
type: person
definition: Bildnis erscheint auf einer Medaille von Alexandre Charpentier.
gender: female
forename: Juliette
surname: Paganon
function or role: Dargestellte/r
in scheme: person
created: 2025-11-03
creator: mk berlin

Dargestellte/r
preferred label: Sitter @en