Ignaz Weifert
type: Concept
type: person
definition: Österreichischer Brauer, Vater des Großindustriellen Georg Weifert (1850-1937).
gender: male
forename: Ignaz
surname: Weifert
date of birth: 1826
date of death: 1911
date of birth and death: 1826-1911
function or role: Dargestellte/r
in scheme: person
created: 2025-11-03
creator: mk berlin

Dargestellte/r
preferred label: Sitter @en