Helene von Manteuffel, geborene von Brandenstein
type: Concept
type: person
preferred label: Helene von Manteuffel, née von Brandenstein @en
definition: Helene von Manteuffel war langjährige Vorsitzende der Brandenburgischen Frauenhilfe.Vermählt mit Otto von Manteuffel 1872 in Merseburg/Saale.
gender: female
forename: Helene von
surname: Manteuffel, geborene von Brandenstein
surname: Manteuffel, née von Brandenstein @en
date of birth: 1847
date of death: 1934
date of birth and death: 1847-1934
function or role: Dargestellte/r
in scheme: person
created: 2025-11-03
modified: 2025-11-03
creator: mk berlin

Dargestellte/r
preferred label: Sitter @en