Tina Joest, geborene Leiden
type: Concept
type: person
preferred label: Tina Jost, née Leiden @en
definition: Ihr Bildnis erscheint 1899 auf einer Plakette von Hermann Hahn.
gender: female
forename: Tina
surname: Joest, geborene Leiden
surname: Jost, née Leiden @en
date of birth: 1819
date of death: 1909
date of birth and death: 1819-1909
function or role: Dargestellte/r
in scheme: person
created: 2025-11-03
modified: 2025-11-03
creator: mk berlin

Dargestellte/r
preferred label: Sitter @en