Günther Johannes Kalliwoda
type: Concept
type: person
definition: Abt und Prälat des Benediktinerkloster Rajhrad/Raigern in Mähren.
gender: male
forename: Günther Johannes
surname: Kalliwoda
date of death: 1883
date of birth and death: -1883
function or role: Dargestellte/r
in scheme: person
created: 2025-11-03
creator: mk berlin

Dargestellte/r
preferred label: Sitter @en