Ivan Josip Vitezić
type: Concept
type: person
definition: Auch Johannes Joseph Vitezić.Bischof von Krk (Veglia) von 1854 bis 1877.
gender: male
forename: Ivan Josip
surname: Vitezić
date of birth: 1806
date of death: 1877
date of birth and death: 1806-1877
function or role: Dargestellte/r
in scheme: person
created: 2025-11-03
creator: mk berlin

Dargestellte/r
preferred label: Sitter @en