Albert Camesina
type: Concept
type: person
definition: Österreichischer Graphiker und Altertumsforscher.
gender: male
forename: Albert
surname: Camesina
date of birth: 1806
date of death: 1881
date of birth and death: 13.05.1806 - 16.06.1881
function or role: Dargestellte/r
in scheme: person
created: 2025-11-03
modified: 2025-11-03
creator: mk berlin

Dargestellte/r
preferred label: Sitter @en