Constanze von Wetter-Rosenthal
type: Concept
type: person
definition: Deutsch-baltische Bildhauerin und Medailleurin.
gender: female
forename: Constanze von
surname: Wetter-Rosenthal
date of birth: 1872
date of death: 1948
date of birth and death: 18.04.1872 - 14.09.1948
function or role: Medailleur/in
in scheme: person
created: 2025-11-03
modified: 2025-11-03
creator: mk berlin

Medailleur/in
preferred label: Medalist @en