Graf Franz Maria Johann Folliot de Crenneville-Poutet
type: Concept
type: person
preferred label: Count Franz Maria Johann Folliot de Crenneville-Poutet @en
definition: Österreichischer General, Feldzeugmeister und Kunstförderer.Bis 1887 Franz Maria Johann Graf Folliot de Crenneville.
gender: male
prefix: Graf
prefix: Count @en
forename: Franz Maria Johann
surname: Folliot de Crenneville-Poutet
date of birth: 1815
date of death: 1888
date of birth and death: 22.03.1815 - 22.06.1888
function or role: Dargestellte/r
in scheme: person
created: 2025-11-03
creator: mk berlin

Dargestellte/r
preferred label: Sitter @en