Hedwig Einstein
type: Concept
type: person
definition: Ältestes Kind von Daniel Einstein und Sophie Lichtenstein.Konzertpianistin. Sie heiratete 1907 den Bildhauer Benno Elkan.Flucht nach London 1935. Dort verstorben 1959.
gender: female
forename: Hedwig
surname: Einstein
date of birth: 1884
date of death: 1959
date of birth and death: 1884-1959
function or role: Dargestellte/r
in scheme: person
created: 2025-11-03
modified: 2025-11-03
creator: mk berlin

Dargestellte/r
preferred label: Sitter @en