André Malraux
type: Concept
type: person
definition: Französischer Schriftsteller und Politiker.
gender: male
forename: André
surname: Malraux
date of birth: 1901
date of death: 1976
date of birth and death: 03.11.1901 - 23.11.1976
function or role: Dargestellte/r
in scheme: person
created: 2025-11-04
creator: mk berlin

Dargestellte/r
preferred label: Sitter @en