Marija Alexandrowna Romanow
type: Concept
type: person
preferred label: Maria Alexandrovna Romanov @en
definition: Russische Großfürstin und seit 1874 Gemahlin von Prinz Alfred von Großbritannien.Durch ihre Heirat Herzogin von Edinburgh und später Herzogin von Sachsen-Coburg und Gotha.
gender: female
forename: Marija Alexandrowna
forename: Maria Alexandrovna @en
surname: Romanow
surname: Romanov @en
date of birth: 1853
date of death: 1920
date of birth and death: 17.10.1853 - 24.10.1920
function or role: Dargestellte/r
in scheme: person
created: 2025-11-04
modified: 2025-11-04
creator: mk berlin

Dargestellte/r
preferred label: Sitter @en