Julius Nitschke
type: Concept
type: person
definition: Herr Gutsbesitzer Julius Nitschke auf Girlachsdorf im Reichenbacher Kreis in Schlesien.Ankauf durch das Münzkabinett Berlin im Jahre 1873.
gender: male
forename: Julius
surname: Nitschke
function or role: Vorbesitzer
in scheme: person
created: 2025-11-05
creator: mk berlin

Vorbesitzer
preferred label: previous Owner @en