Emmanuel Mouterde
type: Concept
type: person
definition: Französischer Knopfhersteller und Medailleur in Lyon.Lit.: L. Forrer, Biographical Dictionary of Medallists IV (1909) 181.
gender: male
forename: Emmanuel
surname: Mouterde
date of birth: 1801
date of death: 1872
date of birth and death: 07.08.1801 - 22.01.1872
function or role: Medailleur/in
in scheme: person
created: 2025-11-06
modified: 2025-11-06
creator: mk berlin

Medailleur/in
preferred label: Medalist @en