Phaenos
type: Concept
type: person
definition: Magistrat in Argos für die Achaische Liga im 2. Jahrhundert v. Chr.Lit.: W. Leschhorn, Lexikon der Aufschriften auf griechischen Münzen II (2009) 858.
gender: male
surname: Phaenos
function or role: Magistrat (Ant)
in scheme: person
created: 2025-11-07
modified: 2025-11-07
creator: mk berlin

Magistrat (Ant)
preferred label: Magistrate (Ant) @en