Paolo Giovio
type: Concept
type: person
definition: Italienischer Geschichtsschreiber, Bischof und Arzt.
gender: male
forename: Paolo
surname: Giovio
date of birth: 1483
date of death: 1552
date of birth and death: 21.04.1483 - 12.12.1552
function or role: Dargestellte/r
in scheme: person
created: 2025-11-07
creator: mk berlin

Dargestellte/r
preferred label: Sitter @en