Dr. Helmut Vester
type: Concept
type: person
definition: Helmut Vester war ein deutscher Apotheker, Pharmaziehistoriker und Sammler.Nachdem ein von ihm gesammeltes „Pharmakognostisches Kabinett“ 1991 mit Mitteln des Vereins „pro Ruhrgebiet“ von der damaligen Abteilung für Geschichte der Medizin der Ruhr-Universität (RUB) übernommen worden war, kamen weitere Teile seiner sehr umfangreichen Sammlung und Dokumentation 2001 als Dauerleihgabe an die RUB.2009 wurde diese Dauerleihgabe in eine Schenkung an die RUB und die Stiftung Ruhr Museum in Essen überführt. Zu der von der RUB übernommenen Schenkung gehört eine umfangreiche numismatische Sammlung zur Geschichte der Pharmazie, der Medizin und der Natuwissenschaften, die rund 1600 Stücke umfasst, meist Medaillen. Betreut wird der Bochumer Bestand von der Medizinhistorischen Sammlung der RUB.Lit.: M. Lischka, Vesters Archiv. Eine universelle Dokumentation und Sammlung zur Geschichte der Pharmazie. Medizin im Museum, Jahrbuch der Medizinhistorischen Sammlung der RUB, Beiheft 1 (1997).
gender: male
prefix: Dr.
forename: Helmut
surname: Vester
date of birth: 1913
date of death: 2001
date of birth and death: 13.03.1913 - 13.12.2001
function or role: Vorbesitzer
in scheme: person
created: 2025-11-11
modified: 2025-11-20
creator: mk berlin

Vorbesitzer
preferred label: previous Owner @en