John Max Wulfing
type: Concept
type: person
definition: Geschäftsmann in Saint Louis, philantrop udn Münzsammler.
gender: male
forename: John Max
surname: Wulfing
date of birth: 1859
date of death: 1929
date of birth and death: 1859-1929
function or role: Vorbesitzer
in scheme: person
created: 2025-11-19
modified: 2025-11-19
creator: mk berlin

Vorbesitzer
preferred label: previous Owner @en