Mihai Viteazul (1593-1601), Fürst der Walachei, der Moldau und von Siebenbürgen
type: Concept
type: person
preferred label: Michael Viteazul (1593-1601), prince of Wallachia, Moldavia, and Transylvania @en
definition: Woiwode der Walachei seit 1593, von Siebenbürgen 1599 und 1600, sowie der Moldau im Jahre 1600.
gender: male
surname: Mihai Viteazul (1593-1601), Fürst der Walachei, der Moldau und von Siebenbürgen
surname: Michael Viteazul (1593-1601), prince of Wallachia, Moldavia, and Transylvania @en
date of birth: 1558
date of death: 1601
date of birth and death: 1558-09.08.1601
function or role: Dargestellte/r
function or role: Autorität
in scheme: person
created: 2025-11-20
modified: 2025-11-20
creator: mk berlin

Dargestellte/r
preferred label: Sitter @en

Autorität
preferred label: Authority @en