Aris...
type: Concept
type: person
definition: Magistrat in Herakleia/Lukanien zwischen 281 und 278 v. Chr.Lit.: W. Leschhorn, Lexikon der Aufschriften auf griechischen Münzen II (2009) 352 (281-278 v. Chr.); Historia Nummorum. Italy (2001) Nr. 1385.
gender: male
surname: Aris...
function or role: Magistrat (Ant)
in scheme: person
created: 2025-11-24
creator: mk berlin

Magistrat (Ant)
preferred label: Magistrate (Ant) @en