Ba...
type: Concept
type: person
definition: Magistrat in Olbia/Sarmatia zwischen ca. 325 und 275 v. Chr.Lit.: W. Leschhorn, Lexikon der Aufschriften auf griechischen Münzen II (2009) 400 (ca. 325-275 v. Chr.).
gender: male
surname: Ba...
function or role: Magistrat (Ant)
in scheme: person
created: 2025-11-24
modified: 2025-11-24
creator: mk berlin

Magistrat (Ant)
preferred label: Magistrate (Ant) @en