Eduard Krause
type: Concept
type: person
definition: Königlicher Museumsconservator Herr Eduard Krause.Deutscher Prähistoriker.Ankauf für das Münzkabinett Berlin im Jahre 1884.
gender: male
forename: Eduard
surname: Krause
date of birth: 1847
date of death: 1917
date of birth and death: 13.06.1847 - 30.10.1917
function or role: Vorbesitzer
in scheme: person
created: 2025-11-24
modified: 2025-11-24
creator: mk berlin

Vorbesitzer
preferred label: previous Owner @en