Sostratos
type: Concept
type: person
definition: Magistrat in Olbia/Sarmatia im 3. Jahrhundert v. Chr.Lit.: W. Leschhorn, Lexikon der Aufschriften auf griechischen Münzen II (2009) 830 (3. Jh. v. Chr.).
gender: male
surname: Sostratos
function or role: Magistrat (Ant)
in scheme: person
created: 2025-11-25
modified: 2025-11-25
creator: mk berlin

Magistrat (Ant)
preferred label: Magistrate (Ant) @en