Alph...
type: Concept
type: person
definition: Magistrat in Olbia/Sarmatia im 3. Jahrhundert v. Chr.Der Name wird hier als ΑΛΦ… gelesen, nicht ΦΛA… wie bei Leschhorn (2009) und SNG British Museum.Lit.: W. Leschhorn, Lexikon der Aufschriften auf griechischen Münzen II (2009) 878 s. v. Phla (3. Jh. v. Chr.); SNG British Museum IX-1 Black Sea Nr. 542 (Phla..., 3. Jh. v. Chr.).
gender: male
surname: Alph...
function or role: Magistrat (Ant)
in scheme: person
created: 2025-11-25
modified: 2025-11-25
creator: mk berlin

Magistrat (Ant)
preferred label: Magistrate (Ant) @en