Boleslav III. (999-1003), Herzog von Böhmen
type: Concept
type: person
preferred label: Bolesław III (999-1003), duke of Bohemia @en
definition: Herzog von Böhmen von 999 bis 1002 und noch einmal 1003.
gender: male
surname: Boleslav III. (999-1003), Herzog von Böhmen
surname: Bolesław III (999-1003), duke of Bohemia @en
date of death: 1037
date of birth and death: -1037
function or role: Autorität
in scheme: person
created: 2025-11-28
creator: mk berlin

Autorität
preferred label: Authority @en