Richard von Passavant
type: Concept
type: person
definition: Deutscher Kaufmann, Sammler und Mäzen.1906 nobilitiert.
gender: male
forename: Richard von
surname: Passavant
date of birth: 1852
date of death: 1923
date of birth and death: 17.10.1852 - 04.11.1923
function or role: Vorbesitzer
in scheme: person
created: 2025-12-01
creator: mk berlin

Vorbesitzer
preferred label: previous Owner @en