István Iván
type: Concept
type: person
definition: Ungarischer Münzgestalter und Medailleur.
gender: male
forename: István
surname: Iván
date of birth: 1905
date of death: 1967
date of birth and death: 23.06.1905 - 25.12.1967
function or role: Entwurf
function or role: Medailleur/in
in scheme: person
created: 2025-12-01
modified: 2025-12-01
creator: mk berlin

Entwurf
preferred label: Design @en

Medailleur/in
preferred label: Medalist @en