Romeo Bravi
type: Concept
type: person
definition: Italienischer Bildhauer und Medailleur, belegt zwischen 1888 und 1944.Lit.: L. Forrer, Biographical Dictionary of Medallists I (1904) 270.
gender: male
forename: Romeo
surname: Bravi
function or role: Medailleur/in
in scheme: person
created: 2025-12-01
creator: mk berlin

Medailleur/in
preferred label: Medalist @en