Auguste Brichaut
type: Concept
type: person
definition: Belgischer Numismatiker.Gab Münzproben und Medaillen heraus, die aber bei anderen Herstellern produziert wurden.
gender: male
forename: Auguste
surname: Brichaut
date of birth: 1836
date of death: 1897
date of birth and death: 24.11.1836 - 03.02.1897
function or role: Medaillenverlag
in scheme: person
created: 2025-12-01
creator: mk berlin

Medaillenverlag
preferred label: Medal Puplisher @en