Abraham Dupré
type: Concept
type: person
definition: Französischer Medailleur.Sohn des Guillaume Dupré.
gender: male
forename: Abraham
surname: Dupré
date of birth: 1604
date of death: 1647
date of birth and death: 1604-1647
function or role: Medailleur/in
in scheme: person
created: 2025-12-01
creator: mk berlin

Medailleur/in
preferred label: Medalist @en