Prof. Marcantonio Genua
type: Concept
type: person
definition: Professor für Philosophie und Medizin an der Universität von Padua.Geboren als Marco Antonio Passeri.
gender: male
prefix: Prof.
forename: Marcantonio
surname: Genua
date of birth: 1491
date of death: 1563
date of birth and death: 1491-1563
function or role: Dargestellte/r
in scheme: person
created: 2025-12-02
modified: 2025-12-02
creator: mk berlin

Dargestellte/r
preferred label: Sitter @en