Leopoldo Insenga
type: Concept
type: person
definition: Italienischer Medailleur.Lit.: L. Forrer, Biographical Dictionary of Medallists III (1907) 27.
gender: male
forename: Leopoldo
surname: Insenga
date of birth: 1840
date of birth and death: 23.12.1840 -
function or role: Medailleur/in
in scheme: person
created: 2025-12-08
creator: mk berlin

Medailleur/in
preferred label: Medalist @en