C. G. Kunze
type: Concept
type: person
definition: Deutsch-Amerikanischer Medailleur, tätig ca. 1850/70.Lit.: L. Forrer, Biographical Dictionary of Medallists III (1907) 248.
gender: male
forename: C. G.
surname: Kunze
function or role: Medailleur/in
in scheme: person
created: 2025-12-08
modified: 2025-12-08
creator: mk berlin

Medailleur/in
preferred label: Medalist @en