Marcelle Renée Lancelot
type: Concept
type: person
definition: Französische Bildhauerin und Medailleurin.
gender: female
forename: Marcelle Renée
surname: Lancelot
date of birth: 1854
date of death: 1946
date of birth and death: 26.01.1854 (1863?) - 1946?
function or role: Medailleur/in
in scheme: person
created: 2025-12-08
modified: 2025-12-08
creator: mk berlin

Medailleur/in
preferred label: Medalist @en