Joseph Luckner
type: Concept
type: person
definition: Deutscher Medailleur und Stempelschneider in Hildesheim.Lit.: L. Forrer, Biographical Dictionary of Medallists III (1907) 489 f.
gender: male
forename: Joseph
surname: Luckner
date of birth: 1735
date of birth and death: um 1735-
function or role: Medailleur/in
function or role: Stempelschneider
in scheme: person
created: 2025-12-08
modified: 2025-12-08
creator: mk berlin

Medailleur/in
preferred label: Medalist @en

Stempelschneider
preferred label: Die-cutter @en