H. Sternberg
type: Concept
type: person
definition: Rumänischer Medailleur in Jassy, belegt um 1900.Lit.: L. Forrer, Biographical Dictionary of Medallists VIII (1930) 221.
gender: male
forename: H.
surname: Sternberg
function or role: Medailleur/in
in scheme: person
created: 2025-12-10
creator: mk berlin

Medailleur/in
preferred label: Medalist @en